Reaction Details
TargetDipeptidyl peptidase 4
LigandBDBM11586
Substrate/CompetitorBDBM11561
Meas. Tech.Fluorogenic Assay
IC50 100±n/a nM
Citation Peters, JUWeber, SKritter, SWeiss, PWallier, ABoehringer, MHennig, MKuhn, BLoeffler, BM Aminomethylpyrimidines as novel DPP-IV inhibitors: a 10(5)-fold activity increase by optimization of aromatic substituents. Bioorg Med Chem Lett14:1491-3 (2004) 
 
Dipeptidyl peptidase 4
Name:Dipeptidyl peptidase 4
Type:Enzyme
Mol. Mass.:88271.01
Organism:Homo sapiens (Human)
Description:P27487
Residue:766
BDBM11586
BDBM11561
NameBDBM11586
Synonyms:1c-para-OMe Aminomethylpyrimidine 1ch
TypeSmall organic molecule
Emp. Form.C18H16Cl2N4O
Mol. Mass.375.252
SMILESCOc1ccc(cc1)-c1nc(N)c(CN)c(n1)-c1ccc(Cl)cc1Cl