Reaction Details
TargetDipeptidyl peptidase 4
LigandBDBM11587
Substrate/CompetitorBDBM11561
Meas. Tech.Fluorogenic Assay
IC50 47±n/a nM
Citation Peters, JUWeber, SKritter, SWeiss, PWallier, ABoehringer, MHennig, MKuhn, BLoeffler, BM Aminomethylpyrimidines as novel DPP-IV inhibitors: a 10(5)-fold activity increase by optimization of aromatic substituents. Bioorg Med Chem Lett14:1491-3 (2004) 
 
Dipeptidyl peptidase 4
Name:Dipeptidyl peptidase 4
Type:Enzyme
Mol. Mass.:88271.01
Organism:Homo sapiens (Human)
Description:P27487
Residue:766
BDBM11587
BDBM11561
NameBDBM11587
Synonyms:1c-ortho-F Aminomethylpyrimidine 1ci
TypeSmall organic molecule
Emp. Form.C17H13Cl2FN4
Mol. Mass.363.216
SMILESNCc1c(N)nc(nc1-c1ccc(Cl)cc1Cl)-c1ccccc1F