Reaction Details
TargetDipeptidyl peptidase 4
LigandBDBM11592
Substrate/CompetitorBDBM11561
Meas. Tech.Fluorogenic Assay
IC50 3±n/a nM
Citation Peters, JUWeber, SKritter, SWeiss, PWallier, ABoehringer, MHennig, MKuhn, BLoeffler, BM Aminomethylpyrimidines as novel DPP-IV inhibitors: a 10(5)-fold activity increase by optimization of aromatic substituents. Bioorg Med Chem Lett14:1491-3 (2004) 
 
Dipeptidyl peptidase 4
Name:Dipeptidyl peptidase 4
Type:Enzyme
Mol. Mass.:88271.01
Organism:Homo sapiens (Human)
Description:P27487
Residue:766
BDBM11592
BDBM11561
NameBDBM11592
Synonyms:5-(aminomethyl)-6-(2,4-dichlorophenyl)-2-(3,4-difluorophenyl)pyrimidin-4-amine | Aminomethylpyrimidine 1d
TypeSmall organic molecule
Emp. Form.C17H12Cl2F2N4
Mol. Mass.381.207
SMILESNCc1c(N)nc(nc1-c1ccc(Cl)cc1Cl)-c1ccc(F)c(F)c1