Reaction Details
TargetCarbonic anhydrase 2
LigandBDBM11636
Substrate/CompetitorBDBM10856
Meas. Tech.CA Inhibition Assay
pH7.5±n/a
Temperature295.15±n/a K
Ki 1.4±n/a nM
Citation Menchise, VDe Simone, GAlterio, VDi Fiore, APedone, CScozzafava, ASupuran, CT Carbonic anhydrase inhibitors: stacking with Phe131 determines active site binding region of inhibitors as exemplified by the X-ray crystal structure of a membrane-impermeant antitumor sulfonamide complexed with isozyme II. J Med Chem48:5721-7 (2005) 
 
Carbonic anhydrase 2
Name:Carbonic anhydrase 2
Type:Enzyme
Mol. Mass.:29250.71
Organism:Homo sapiens (Human)
Description:P00918
Residue:260
BDBM11636
BDBM10856
NameBDBM11636
Synonyms:CHEMBL309431 Sulfonamide 3
TypeSmall organic molecule
Emp. Form.C15H22N6O5S3
Mol. Mass.462.567
SMILESCCN(CC)CCNC(=O)c1ccc(cc1)S(=O)(=O)Nc1nnc(s1)S(N)(=O)=O