Reaction Details
TargetTyrosine-protein kinase BTK
LigandBDBM325814
Substrate/Competitorn/a
Meas. Tech.LANCE (Lanthanide Chelate Excite) TR-FRET (Time-resolved fluorescence resonance energy transfer) assay
IC50 2.00±n/a nM
Citation Liu, JKim, RMKozlowski, JKrikorian, ADAnand, R Btk inhibitors US Patent US9637486 Publication Date 5/2/2017
 
Tyrosine-protein kinase BTK
Name:Tyrosine-protein kinase BTK
Type:Enzyme
Mol. Mass.:76289.95
Organism:Homo sapiens (Human)
Description:Q06187
Residue:659
BDBM325814
NameBDBM325814
Synonyms:1-(4-phenoxyphenyl)-3- [(3R)-1- propanoylpiperidin-3-yl]- 1H-pyrazolo[3,4- c]pyridin-7-amine | US9637486, Example 2
TypeSmall organic molecule
Emp. Form.C26H27N5O2
Mol. Mass.441.5249
SMILESCCC(=O)N1CCC[C@H](C1)c1nn(-c2ccc(Oc3ccccc3)cc2)c2c(N)nccc12