Reaction Details
TargetCarboxypeptidase B2
LigandBDBM326395
Substrate/Competitorn/a
Meas. Tech.Enzyme Inhibitory Assay
IC50 8.30±n/a nM
Citation Nagata, TKobayashi, JOnishi, YKishida, MNoguchi, K Cyclopropanecarboxylic acid derivative US Patent US9662310 Publication Date 5/30/2017
 
Carboxypeptidase B2
Name:Carboxypeptidase B2
Type:Enzyme
Mol. Mass.:48432.74
Organism:Homo sapiens (Human)
Description:Q96IY4
Residue:423
BDBM326395
NameBDBM326395
Synonyms:(1R,2S)-2-[(2R)-2-(Aminomethyl)butyl]-1-(1-pyridin-2-yl-1H-imidazol-4-yl)cyclopropanecarboxylic acid | US9662310, Example 60
TypeSmall organic molecule
Emp. Form.C17H22N4O2
Mol. Mass.314.3822
SMILESCC[C@@H](CN)CC1C[C@]1(C(O)=O)c1cn(cn1)-c1ccccn1