Reaction Details
TargetLeukotriene A-4 hydrolase
LigandBDBM327137
Substrate/Competitorn/a
Meas. Tech.Enzyme Assay
IC50 0.080±n/a nM
Citation Bylock, LA Benzodioxane inhibitors of leukotriene production for combination therapy US Patent US9662339 Publication Date 5/30/2017
 
Leukotriene A-4 hydrolase
Name:Leukotriene A-4 hydrolase
Type:Hydrolase; metalloprotease
Mol. Mass.:69280.41
Organism:Homo sapiens (Human)
Description:Human recombinant LTA4H.
Residue:611
BDBM327137
NameBDBM327137
Synonyms:4-(1-{4-[(3S)-2,3- dihydro[1,4]dioxino[2,3- b]pyridin-3-yl]benzyl}piperidin-4- yl)benzoic acid | US9662339, 235
TypeSmall organic molecule
Emp. Form.C26H26N2O4
Mol. Mass.430.4956
SMILESOC(=O)c1ccc(cc1)C1CCN(Cc2ccc(cc2)[C@H]2COc3cccnc3O2)CC1