Reaction Details
TargetSerine/threonine-protein kinase Chk1
LigandBDBM329008
Substrate/Competitorn/a
Meas. Tech.Caliper Assay
IC50 20.0±n/a nM
Citation Collins, IMatthews, TPMchardy, TFOsborne, JLainchbury, MWalton, MIGarrett, MD 5-[[4-[[morpholin-2-yl]methylamino]-5-(trifluoromethyl)-2-pyridyl]amino]pyrazine-2-carbonitrile and therapeutic uses thereof US Patent US9663503 Publication Date 5/30/2017
 
Serine/threonine-protein kinase Chk1
Name:Serine/threonine-protein kinase Chk1
Type:Enzyme Catalytic Domain
Mol. Mass.:54443.02
Organism:Homo sapiens (Human)
Description:gi_166295192
Residue:476
BDBM329008
NameBDBM329008
Synonyms:1137477-35-0 US9663503, Compound Y-102
TypeSmall organic molecule
Emp. Form.C22H22N8O2
Mol. Mass.430.4625
SMILESO=C(Nc1ccccc1)c1cnc(Nc2cnc(cn2)C#N)cc1NCC1CNCCO1