Reaction Details
TargetDual specificity protein kinase TTK
LigandBDBM329346
Substrate/Competitorn/a
Meas. Tech.Mps-1 Kinase Assay
IC50<1.000±n/a nM
Citation Schulze, VKosemund, DWengner, AMSiemeister, GStöckigt, DBrüning, M Substituted triazolopyridines and their use as TTK inhibitors US Patent US9663510 Publication Date 5/30/2017
 
Dual specificity protein kinase TTK
Name:Dual specificity protein kinase TTK
Type:Protein
Mol. Mass.:97086.79
Organism:Homo sapiens (Human)
Description:P33981
Residue:857
BDBM329346
NameBDBM329346
Synonyms:(2R)-2-(4-fluorophenyl)-N-[4-(2-{[2-methoxy-4-(pyrrolidin-1-ylcarbonyl)phenyl]amino}[1,2,4]triazolo[1,5-a]pyridin-6-yl)phenyl]propanamide | US9663510, Example 01.13
TypeSmall organic molecule
Emp. Form.C33H31FN6O3
Mol. Mass.578.636
SMILESCOc1cc(ccc1Nc1nc2ccc(cn2n1)-c1ccc(NC(=O)[C@H](C)c2ccc(F)cc2)cc1)C(=O)N1CCCC1