Reaction Details
TargetDual specificity protein kinase TTK
LigandBDBM329352
Substrate/Competitorn/a
Meas. Tech.Mps-1 Kinase Assay
IC50<1.000±n/a nM
Citation Schulze, VKosemund, DWengner, AMSiemeister, GStöckigt, DBrüning, M Substituted triazolopyridines and their use as TTK inhibitors US Patent US9663510 Publication Date 5/30/2017
 
Dual specificity protein kinase TTK
Name:Dual specificity protein kinase TTK
Type:Protein
Mol. Mass.:97086.79
Organism:Homo sapiens (Human)
Description:P33981
Residue:857
BDBM329352
NameBDBM329352
Synonyms:(2R)-2-amino-2-(4-fluorophenyl)-N-[4-(2-{[4-(methylsulfonyl)-2-(2,2,2-trifluoroethoxyl)phenyl]amino}[1,2,4]triazolo[1,5-a]pyridin-6-yl)phenyl]ethanamide | US9663510, Example 01.19
TypeSmall organic molecule
Emp. Form.C29H24F4N6O4S
Mol. Mass.628.597
SMILESCS(=O)(=O)c1ccc(Nc2nc3ccc(cn3n2)-c2ccc(NC(=O)[C@H](N)c3ccc(F)cc3)cc2)c(OCC(F)(F)F)c1