Reaction Details
TargetcAMP and cAMP-inhibited cGMP 3',5'-cyclic phosphodiesterase 10A
LigandBDBM329409
Substrate/Competitorn/a
Meas. Tech.Fluorescence Polarization Assay
Ki 0.010±n/a nM
Citation Kuduk, SDMcComas, CCReger, TS Pyrimidine PDE10 inhibitors US Patent US9663513 Publication Date 5/30/2017
 
cAMP and cAMP-inhibited cGMP 3',5'-cyclic phosphodiesterase 10A
Name:cAMP and cAMP-inhibited cGMP 3',5'-cyclic phosphodiesterase 10A
Type:Protein
Mol. Mass.:88412.52
Organism:Homo sapiens (Human)
Description:Q9Y233
Residue:1055
BDBM329409
NameBDBM329409
Synonyms:4-(2-methyl-4- (((1S,2S)-2-(quinolin-2- yl)cyclopropyl)methoxy) pyrimidin-5-yl)benzoic acid (enantiomer A) US9663513, 23
TypeSmall organic molecule
Emp. Form.C25H21N3O3
Mol. Mass.411.4525
SMILESCc1ncc(c(OC[C@H]2C[C@@H]2c2ccc3ccccc3n2)n1)-c1ccc(cc1)C(O)=O