Reaction Details
TargetcAMP and cAMP-inhibited cGMP 3',5'-cyclic phosphodiesterase 10A
LigandBDBM329542
Substrate/Competitorn/a
Meas. Tech.Fluorescence Polarization Assay
Ki 0.010±n/a nM
Citation Kuduk, SDMcComas, CCReger, TS Pyrimidine PDE10 inhibitors US Patent US9663513 Publication Date 5/30/2017
 
cAMP and cAMP-inhibited cGMP 3',5'-cyclic phosphodiesterase 10A
Name:cAMP and cAMP-inhibited cGMP 3',5'-cyclic phosphodiesterase 10A
Type:Protein
Mol. Mass.:88412.52
Organism:Homo sapiens (Human)
Description:Q9Y233
Residue:1055
BDBM329542
NameBDBM329542
Synonyms:2-((1S,2S)-2-((2-methyl- 5-(pyridin-3- yl)pyrimidin-4- yloxy)methyl)cyclopropyl) quinoline | US9663513, 155
TypeSmall organic molecule
Emp. Form.C23H20N4O
Mol. Mass.368.4311
SMILESCc1ncc(c(OC[C@H]2C[C@@H]2c2ccc3ccccc3n2)n1)-c1cccnc1