Reaction Details
TargetcAMP and cAMP-inhibited cGMP 3',5'-cyclic phosphodiesterase 10A
LigandBDBM329544
Substrate/Competitorn/a
Meas. Tech.Fluorescence Polarization Assay
Ki 0.020±n/a nM
Citation Kuduk, SDMcComas, CCReger, TS Pyrimidine PDE10 inhibitors US Patent US9663513 Publication Date 5/30/2017
 
cAMP and cAMP-inhibited cGMP 3',5'-cyclic phosphodiesterase 10A
Name:cAMP and cAMP-inhibited cGMP 3',5'-cyclic phosphodiesterase 10A
Type:Protein
Mol. Mass.:88412.52
Organism:Homo sapiens (Human)
Description:Q9Y233
Residue:1055
BDBM329544
NameBDBM329544
Synonyms:2-(5-(2-methyl-4- (((1S,2S)-2-(quinolin-2- yl)cyclopropyl)methoxy) pyrimidin-5-yl)pyridin-2- yl)propan-2-ol | US9663513, 157
TypeSmall organic molecule
Emp. Form.C26H26N4O2
Mol. Mass.426.5102
SMILESCc1ncc(-c2ccc(nc2)C(C)(C)O)c(OC[C@H]2C[C@@H]2c2ccc3ccccc3n2)n1