Reaction Details
TargetNuclear receptor ROR-gamma
LigandBDBM329646
Substrate/Competitorn/a
Meas. Tech.Binding Assay
Ki<100±n/a nM
Citation Claremon, DADillard, LWDong, CFan, YLotesta, SDMarcus, ASingh, SBTice, CMYuan, JZhao, WZhuang, L Dihydropyrrolopyridine inhibitors of ROR-gamma US Patent US9663515 Publication Date 5/30/2017
 
Nuclear receptor ROR-gamma
Name:Nuclear receptor ROR-gamma
Type:Enzyme Catalytic Domain
Mol. Mass.:58218.40
Organism:Homo sapiens (Human)
Description:P51449
Residue:518
BDBM329646
NameBDBM329646
Synonyms:(R)-2-((S)-7-ethyl-6-((trans-4-(trifluoromethyl)cyclohexyl)methyl)-6,7-dihydro-5H-pyrrolo[3,4-b]pyridine-3-carboxamido)-2-(4-(ethylsulfonyl)phenyl)ethyl carbamate US9663515, Compound 2
TypeSmall organic molecule
Emp. Form.C29H37F3N4O5S
Mol. Mass.610.688
SMILESCC[C@@H]1N(C[C@H]2CC[C@@H](CC2)C(F)(F)F)Cc2cc(cnc12)C(=O)N[C@@H](COC(N)=O)c1ccc(cc1)S(=O)(=O)CC