Reaction Details
TargetNuclear receptor ROR-gamma
LigandBDBM329647
Substrate/Competitorn/a
Meas. Tech.Binding Assay
Ki<100±n/a nM
Citation Claremon, DADillard, LWDong, CFan, YLotesta, SDMarcus, ASingh, SBTice, CMYuan, JZhao, WZhuang, L Dihydropyrrolopyridine inhibitors of ROR-gamma US Patent US9663515 Publication Date 5/30/2017
 
Nuclear receptor ROR-gamma
Name:Nuclear receptor ROR-gamma
Type:Enzyme Catalytic Domain
Mol. Mass.:58218.40
Organism:Homo sapiens (Human)
Description:P51449
Residue:518
BDBM329647
NameBDBM329647
Synonyms:US11001583, Compound 3 | US9663515, Compound 3
TypeSmall organic molecule
Emp. Form.C28H36F3N3O5S
Mol. Mass.583.663
SMILESCC[C@@H]1N(C[C@H]2CC[C@@H](OC2)C(F)(F)F)Cc2cc(cnc12)C(=O)N[C@@H](COC)c1ccc(cc1)S(=O)(=O)CC