Reaction Details
TargetNuclear receptor ROR-gamma
LigandBDBM329653
Substrate/Competitorn/a
Meas. Tech.Binding Assay
Ki<100±n/a nM
Citation Claremon, DADillard, LWDong, CFan, YLotesta, SDMarcus, ASingh, SBTice, CMYuan, JZhao, WZhuang, L Dihydropyrrolopyridine inhibitors of ROR-gamma US Patent US9663515 Publication Date 5/30/2017
 
Nuclear receptor ROR-gamma
Name:Nuclear receptor ROR-gamma
Type:Enzyme Catalytic Domain
Mol. Mass.:58218.40
Organism:Homo sapiens (Human)
Description:P51449
Residue:518
BDBM329653
NameBDBM329653
Synonyms:US11001583, Compound 9 | US9663515, Compound 9
TypeSmall organic molecule
Emp. Form.C29H38F3N5O5S
Mol. Mass.625.703
SMILESCCS(=O)(=O)c1ccc(nc1)[C@@H](COC(N)=O)NC(=O)c1cnc2[C@H](C(C)C)N(C[C@H]3CC[C@H](CC3)C(F)(F)F)Cc2c1