Reaction Details
TargetBromodomain-containing protein 4
LigandBDBM329749
Substrate/Competitorn/a
Meas. Tech.Time-Resolved Fluorescence Resonance energy Transfer (TR-FRET) Assay
IC50 30.0±n/a nM
Citation Schmees, NKuhnke, JHaendler, BNeuhaus, RLejeune, PSiegel, SKrüger, MFernandez-Montalvan, AEKünzer, HGallenkamp, D BET protein-inhibiting 5-aryltriazoleazepines US Patent US9663523 Publication Date 5/30/2017
 
Bromodomain-containing protein 4
Name:Bromodomain-containing protein 4
Type:Protein
Mol. Mass.:152264.84
Organism:Homo sapiens (Human)
Description:O60885
Residue:1362
BDBM329749
NameBDBM329749
Synonyms:Preparation of (−)-2-[(4R)-6-(4-chlorophenyl)-1-methyl-4H-[1,2,4]triazolo[4,3-a][1]benzazepin-4-yl]-N-ethylacetamide | US9663523, Example 13
TypeSmall organic molecule
Emp. Form.C22H21ClN4O
Mol. Mass.392.881
SMILESCCNC(=O)C[C@H]1C=C(c2ccc(Cl)cc2)c2ccccc2-n2c(C)nnc12