Reaction Details
TargetBromodomain-containing protein 4
LigandBDBM329766
Substrate/Competitorn/a
Meas. Tech.Time-Resolved Fluorescence Resonance energy Transfer (TR-FRET) Assay
IC50 80.0±n/a nM
Citation Schmees, NKuhnke, JHaendler, BNeuhaus, RLejeune, PSiegel, SKrüger, MFernandez-Montalvan, AEKünzer, HGallenkamp, D BET protein-inhibiting 5-aryltriazoleazepines US Patent US9663523 Publication Date 5/30/2017
 
Bromodomain-containing protein 4
Name:Bromodomain-containing protein 4
Type:Protein
Mol. Mass.:152264.84
Organism:Homo sapiens (Human)
Description:O60885
Residue:1362
BDBM329766
NameBDBM329766
Synonyms:Preparation of 2-[6-(4-chlorophenyl)-1-methyl-4H-[1,2,4]triazolo[4,3-a][1]benzazepin-4-yl]-1-(1,1-dioxido-1,3-thiazolidin-3-yl)ethanone | US9663523, Example 30
TypeSmall organic molecule
Emp. Form.C23H21ClN4O3S
Mol. Mass.468.956
SMILESCc1nnc2C(CC(=O)N3CCS(=O)(=O)C3)C=C(c3ccc(Cl)cc3)c3ccccc3-n12