Reaction Details
TargetUbiquitin-conjugating enzyme E2 E1
LigandBDBM329846
Substrate/Competitorn/a
Meas. Tech.HTRF Assay
IC50<10±n/a nM
Citation Afroze, RBharathan, ITCiavarri, JPFleming, PEGaulin, JLGirard, MLangston, SPSoucy, FWong, TYe, Y Pyrazolopyrimidinyl inhibitors of ubiquitin-activating enzyme US Patent US9663525 Publication Date 5/30/2017
 
Ubiquitin-conjugating enzyme E2 E1
Name:Ubiquitin-conjugating enzyme E2 E1
Type:n/a
Mol. Mass.:21408.98
Organism:Homo sapiens (Human)
Description:P51965
Residue:193
BDBM329846
NameBDBM329846
Synonyms:(rac)-[(1R,2R,3S,4R)-4-{[2-(5-chloro-1H-indol-3-yl)pyrazolo[1,5-a]pyrimidin-7- US9663525, Compound I-054 | US9796725, Compound I-054
TypeSmall organic molecule
Emp. Form.C20H21ClN6O5S
Mol. Mass.492.936
SMILESNS(=O)(=O)OC[C@H]1C[C@@H](Nc2ccnc3cc(nn23)-c2c[nH]c3ccc(Cl)cc23)[C@H](O)[C@@H]1O