Reaction Details
TargetUbiquitin-conjugating enzyme E2 E1
LigandBDBM329864
Substrate/Competitorn/a
Meas. Tech.HTRF Assay
IC50<10±n/a nM
Citation Afroze, RBharathan, ITCiavarri, JPFleming, PEGaulin, JLGirard, MLangston, SPSoucy, FWong, TYe, Y Pyrazolopyrimidinyl inhibitors of ubiquitin-activating enzyme US Patent US9663525 Publication Date 5/30/2017
 
Ubiquitin-conjugating enzyme E2 E1
Name:Ubiquitin-conjugating enzyme E2 E1
Type:n/a
Mol. Mass.:21408.98
Organism:Homo sapiens (Human)
Description:P51965
Residue:193
BDBM329864
NameBDBM329864
Synonyms:(rac)-((1R,2R,3S,4R)-2,3-dihydroxy-4-(2-(2-methoyphenyl)pyrazolo[1,5- US9663525, Compound I-072 | US9796725, Compound I-072
TypeSmall organic molecule
Emp. Form.C19H23N5O6S
Mol. Mass.449.481
SMILESCOc1ccccc1-c1cc2nccc(N[C@@H]3C[C@H](COS(N)(=O)=O)[C@@H](O)[C@H]3O)n2n1