Reaction Details
TargetUbiquitin-conjugating enzyme E2 E1
LigandBDBM329873
Substrate/Competitorn/a
Meas. Tech.HTRF Assay
IC50<10±n/a nM
Citation Afroze, RBharathan, ITCiavarri, JPFleming, PEGaulin, JLGirard, MLangston, SPSoucy, FWong, TYe, Y Pyrazolopyrimidinyl inhibitors of ubiquitin-activating enzyme US Patent US9663525 Publication Date 5/30/2017
 
Ubiquitin-conjugating enzyme E2 E1
Name:Ubiquitin-conjugating enzyme E2 E1
Type:n/a
Mol. Mass.:21408.98
Organism:Homo sapiens (Human)
Description:P51965
Residue:193
BDBM329873
NameBDBM329873
Synonyms:(rac)-((1R,2R,3S,4R)-4-(2-(5-fluorobenzo[b]thiophen-3-yl)pyrazolo[1,5-a]pyrimidin- US9663525, Compound I-081 | US9796725, Compound I-081
TypeSmall organic molecule
Emp. Form.C20H20FN5O5S2
Mol. Mass.493.532
SMILESNS(=O)(=O)OC[C@H]1C[C@@H](Nc2ccnc3cc(nn23)-c2csc3ccc(F)cc23)[C@H](O)[C@@H]1O