Reaction Details
TargetUbiquitin-conjugating enzyme E2 E1
LigandBDBM329874
Substrate/Competitorn/a
Meas. Tech.HTRF Assay
IC50<10±n/a nM
Citation Afroze, RBharathan, ITCiavarri, JPFleming, PEGaulin, JLGirard, MLangston, SPSoucy, FWong, TYe, Y Pyrazolopyrimidinyl inhibitors of ubiquitin-activating enzyme US Patent US9663525 Publication Date 5/30/2017
 
Ubiquitin-conjugating enzyme E2 E1
Name:Ubiquitin-conjugating enzyme E2 E1
Type:n/a
Mol. Mass.:21408.98
Organism:Homo sapiens (Human)
Description:P51965
Residue:193
BDBM329874
NameBDBM329874
Synonyms:(rac)-((1R,2R,3S,4R)-2,3-dihydroxy-4-(2-(3-(2-methoxypropan-2- US9663525, Compound I-082 | US9796725, Compound I-082
TypeSmall organic molecule
Emp. Form.C22H29N5O6S
Mol. Mass.491.561
SMILESCOC(C)(C)c1cccc(c1)-c1cc2nccc(N[C@@H]3C[C@H](COS(N)(=O)=O)[C@@H](O)[C@H]3O)n2n1