Reaction Details
TargetUbiquitin-conjugating enzyme E2 E1
LigandBDBM329878
Substrate/Competitorn/a
Meas. Tech.HTRF Assay
IC50<10±n/a nM
Citation Afroze, RBharathan, ITCiavarri, JPFleming, PEGaulin, JLGirard, MLangston, SPSoucy, FWong, TYe, Y Pyrazolopyrimidinyl inhibitors of ubiquitin-activating enzyme US Patent US9663525 Publication Date 5/30/2017
 
Ubiquitin-conjugating enzyme E2 E1
Name:Ubiquitin-conjugating enzyme E2 E1
Type:n/a
Mol. Mass.:21408.98
Organism:Homo sapiens (Human)
Description:P51965
Residue:193
BDBM329878
NameBDBM329878
Synonyms:(rac)-((1R,2R,3S,4R)-4-(2-(benzofuran-2-yl)pyrazolo[1,5-a]pyrimidin-7-ylamino)-2,3- US9663525, Compound I-086 | US9796725, Compound I-086
TypeSmall organic molecule
Emp. Form.C20H21N5O6S
Mol. Mass.459.476
SMILESNS(=O)(=O)OC[C@H]1C[C@@H](Nc2ccnc3cc(nn23)-c2cc3ccccc3o2)[C@H](O)[C@@H]1O