Reaction Details
TargetUbiquitin-conjugating enzyme E2 E1
LigandBDBM329898
Substrate/Competitorn/a
Meas. Tech.HTRF Assay
IC50<10±n/a nM
Citation Afroze, RBharathan, ITCiavarri, JPFleming, PEGaulin, JLGirard, MLangston, SPSoucy, FWong, TYe, Y Pyrazolopyrimidinyl inhibitors of ubiquitin-activating enzyme US Patent US9663525 Publication Date 5/30/2017
 
Ubiquitin-conjugating enzyme E2 E1
Name:Ubiquitin-conjugating enzyme E2 E1
Type:n/a
Mol. Mass.:21408.98
Organism:Homo sapiens (Human)
Description:P51965
Residue:193
BDBM329898
NameBDBM329898
Synonyms:(s.e.)-((1R,2R,3S,4R)-2,3-dihydroxy-4-(2-(4-methoxynaphthalen-1-yl)pyrazolo[1,5- US9663525, Compound I-106 | US9796725, Compound I-106
TypeSmall organic molecule
Emp. Form.C23H25N5O6S
Mol. Mass.499.54
SMILESCOc1ccc(-c2cc3nccc(N[C@@H]4C[C@H](COS(N)(=O)=O)[C@@H](O)[C@H]4O)n3n2)c2ccccc12