Reaction Details
TargetCarbonic anhydrase 2 [F130V]
LigandBDBM12014
Substrate/CompetitorBDBM11402
Meas. Tech.In vitro binding of inhibitor to hCA-II
pH7.4±n/a
Temperature310.15±n/a K
Kd 2.3±n/a nM
Citation Kim, CYChandra, PPJain, AChristianson, DW Fluoroaromatic-fluoroaromatic interactions between inhibitors bound in the crystal lattice of human carbonic anhydrase II. J Am Chem Soc123:9620-7 (2001) 
 
Carbonic anhydrase 2 [F130V]
Name:Carbonic anhydrase 2 [F130V]
Type:Enzyme
Mol. Mass.:29202.67
Organism:Homo sapiens (Human)
Description:P00918[F130V]
Residue:260
BDBM12014
BDBM11402
NameBDBM12014
Synonyms:2-fluoro-SBB N-[(2-fluorophenyl)methyl]-4-sulfamoylbenzamide
TypeSmall organic molecule
Emp. Form.C14H13FN2O3S
Mol. Mass.308.328
SMILESNS(=O)(=O)c1ccc(cc1)C(=O)NCc1ccccc1F