Reaction Details
TargetSigma non-opioid intracellular receptor 1
LigandBDBM312166
Substrate/Competitorn/a
Meas. Tech.Receptor Assay
Ki 7.59±0.08 nM
Citation McCurdy, CRMesangeau, CChin, FTJames, MLShen, BGambhir, SBiswal, SBehera, D Highly selective sigma receptor ligands and radioligands as probes in nociceptive processing and the pathphysiological study of memory deficits and cognitive disorders US Patent US9724435 Publication Date 8/8/2017
 
Sigma non-opioid intracellular receptor 1
Name:Sigma non-opioid intracellular receptor 1
Type:Enzyme Catalytic Domain
Mol. Mass.:25266.54
Organism:RAT
Description:Q9R0C9
Residue:223
BDBM312166
NameBDBM312166
Synonyms:US9604926, Compound CM-170 | US9724435, Compound CM-170
TypeSmall organic molecule
Emp. Form.C21H24FN3O2
Mol. Mass.369.4326
SMILESFc1ccc(cc1)N1CCN(CCCCn2c3ccccc3oc2=O)CC1