Reaction Details
TargetSigma intracellular receptor 2
LigandBDBM330349
Substrate/Competitorn/a
Meas. Tech.Receptor Assay
Ki 0.006±0.00096 nM
Citation McCurdy, CRMesangeau, CChin, FTJames, MLShen, BGambhir, SBiswal, SBehera, D Highly selective sigma receptor ligands and radioligands as probes in nociceptive processing and the pathphysiological study of memory deficits and cognitive disorders US Patent US9724435 Publication Date 8/8/2017
 
Sigma intracellular receptor 2
Name:Sigma intracellular receptor 2
Type:Protein
Mol. Mass.:20953.88
Organism:Rattus norvegicus (Rat)
Description:Q5U3Y7
Residue:176
BDBM330349
NameBDBM330349
Synonyms:US9724435, Compound CM-366
TypeSmall organic molecule
Emp. Form.C27H34FN3O2
Mol. Mass.451.5762
SMILESFc1ccc(cc1)-c1ccc2oc(=O)n(CCCCN3CCN(CC3)C3CCCCC3)c2c1