Reaction Details
TargetSigma intracellular receptor 2
LigandBDBM50374602
Substrate/Competitorn/a
Meas. Tech.Receptor Assay
Ki 1.49±0.18 nM
Citation McCurdy, CRMesangeau, CChin, FTJames, MLShen, BGambhir, SBiswal, SBehera, D Highly selective sigma receptor ligands and radioligands as probes in nociceptive processing and the pathphysiological study of memory deficits and cognitive disorders US Patent US9724435 Publication Date 8/8/2017
 
Sigma intracellular receptor 2
Name:Sigma intracellular receptor 2
Type:Protein
Mol. Mass.:20953.88
Organism:Rattus norvegicus (Rat)
Description:Q5U3Y7
Residue:176
BDBM50374602
NameBDBM50374602
Synonyms:CHEMBL272608 US9724435, Compound SN-102
TypeSmall organic molecule
Emp. Form.C23H35N3OS
Mol. Mass.401.609
SMILESO=c1sc2ccccc2n1CCCCCCN1CCN(CC1)C1CCCCC1