Reaction Details
TargetCholesterol side-chain cleavage enzyme, mitochondrial
LigandBDBM330382
Substrate/Competitorn/a
Meas. Tech.Cyp11 Assay
IC50 24.0±n/a nM
Citation Blass, BEAbou-Gharbia, MAChilders, WEIyer, PBoruwa, J Cytochrome P450 inhibitors and their method of use US Patent US9725436 Publication Date 8/8/2017
 
Cholesterol side-chain cleavage enzyme, mitochondrial
Name:Cholesterol side-chain cleavage enzyme, mitochondrial
Type:Protein
Mol. Mass.:60346.75
Organism:Bos taurus (Bovine)
Description:P00189
Residue:520
BDBM330382
NameBDBM330382
Synonyms:US9725436, Entry 2
TypeSmall organic molecule
Emp. Form.C23H25ClN4O2S
Mol. Mass.456.988
SMILESCS(=O)(=O)N1CCN(CC1)c1ccc(\C=C\c2cc(Cl)cc(Cn3ccnc3)c2)cc1