Reaction Details
TargetCholesterol side-chain cleavage enzyme, mitochondrial
LigandBDBM330388
Substrate/Competitorn/a
Meas. Tech.Cyp11 Assay
IC50 51.0±n/a nM
Citation Blass, BEAbou-Gharbia, MAChilders, WEIyer, PBoruwa, J Cytochrome P450 inhibitors and their method of use US Patent US9725436 Publication Date 8/8/2017
 
Cholesterol side-chain cleavage enzyme, mitochondrial
Name:Cholesterol side-chain cleavage enzyme, mitochondrial
Type:Protein
Mol. Mass.:60346.75
Organism:Bos taurus (Bovine)
Description:P00189
Residue:520
BDBM330388
NameBDBM330388
Synonyms:US9725436, Entry 7
TypeSmall organic molecule
Emp. Form.C26H26ClN3O2S
Mol. Mass.480.022
SMILESClc1cc(\C=C\c2ccc(cc2)N2CCN(CC2)S(=O)(=O)C2CC2)cc(c1)-c1ccncc1