Reaction Details
TargetCholesterol side-chain cleavage enzyme, mitochondrial
LigandBDBM330394
Substrate/Competitorn/a
Meas. Tech.Cyp11 Assay
IC50 1400±n/a nM
Citation Blass, BEAbou-Gharbia, MAChilders, WEIyer, PBoruwa, J Cytochrome P450 inhibitors and their method of use US Patent US9725436 Publication Date 8/8/2017
 
Cholesterol side-chain cleavage enzyme, mitochondrial
Name:Cholesterol side-chain cleavage enzyme, mitochondrial
Type:Protein
Mol. Mass.:60346.75
Organism:Bos taurus (Bovine)
Description:P00189
Residue:520
BDBM330394
NameBDBM330394
Synonyms:US9725436, Entry 13
TypeSmall organic molecule
Emp. Form.C23H25FN6
Mol. Mass.404.4832
SMILESNC(=N)N1CCN(CC1)c1ccc(\C=C\c2cc(F)cc(Cn3ccnc3)c2)cc1