Reaction Details
TargetCholesterol side-chain cleavage enzyme, mitochondrial
LigandBDBM330397
Substrate/Competitorn/a
Meas. Tech.Cyp11 Assay
IC50 73.0±n/a nM
Citation Blass, BEAbou-Gharbia, MAChilders, WEIyer, PBoruwa, J Cytochrome P450 inhibitors and their method of use US Patent US9725436 Publication Date 8/8/2017
 
Cholesterol side-chain cleavage enzyme, mitochondrial
Name:Cholesterol side-chain cleavage enzyme, mitochondrial
Type:Protein
Mol. Mass.:60346.75
Organism:Bos taurus (Bovine)
Description:P00189
Residue:520
BDBM330397
NameBDBM330397
Synonyms:US9725436, Entry 16
TypeSmall organic molecule
Emp. Form.C24H24FN5O2S
Mol. Mass.465.543
SMILESFc1cc(Cn2ccnc2)cc(\C=C\c2ccc(cc2)N2CCN(CC2)S(=O)(=O)C[N+]#[C-])c1