Reaction Details
TargetCholesterol side-chain cleavage enzyme, mitochondrial
LigandBDBM330398
Substrate/Competitorn/a
Meas. Tech.Cyp11 Assay
IC50 130±n/a nM
Citation Blass, BEAbou-Gharbia, MAChilders, WEIyer, PBoruwa, J Cytochrome P450 inhibitors and their method of use US Patent US9725436 Publication Date 8/8/2017
 
Cholesterol side-chain cleavage enzyme, mitochondrial
Name:Cholesterol side-chain cleavage enzyme, mitochondrial
Type:Protein
Mol. Mass.:60346.75
Organism:Bos taurus (Bovine)
Description:P00189
Residue:520
BDBM330398
NameBDBM330398
Synonyms:US9725436, Entry 17
TypeSmall organic molecule
Emp. Form.C25H26ClN5O
Mol. Mass.447.96
SMILESClc1cc(Cn2ccnc2)cc(\C=C\c2ccc(cc2)N2CCN(CC2)C2=NCCO2)c1