Reaction Details
TargetProstaglandin D2 receptor 2
LigandBDBM330435
Substrate/Competitorn/a
Meas. Tech.Receptor Binding Inhibition Assay
Ki 0.590±n/a nM
Citation Hata, KMasuda, MNakai, HTaniyama, DTobinaga, HHato, YFujiu, M Heterocyclic derivative having PGD2 receptor antagonist activity US Patent US9725442 Publication Date 8/8/2017
 
Prostaglandin D2 receptor 2
Name:Prostaglandin D2 receptor 2
Type:Enzyme
Mol. Mass.:43295.45
Organism:Homo sapiens (Human)
Description:Q9Y5Y4
Residue:395
BDBM330435
NameBDBM330435
Synonyms:US9725442, Compound I-49
TypeSmall organic molecule
Emp. Form.C20H19ClFN3O4S
Mol. Mass.451.899
SMILESC[C@@H]1CN(C[C@@H]1n1nc(CC(O)=O)c2ccc(F)cc12)S(=O)(=O)c1ccc(Cl)cc1