Reaction Details
TargetProstaglandin D2 receptor 2
LigandBDBM330437
Substrate/Competitorn/a
Meas. Tech.Receptor Binding Inhibition Assay
Ki 4.30±n/a nM
Citation Hata, KMasuda, MNakai, HTaniyama, DTobinaga, HHato, YFujiu, M Heterocyclic derivative having PGD2 receptor antagonist activity US Patent US9725442 Publication Date 8/8/2017
 
Prostaglandin D2 receptor 2
Name:Prostaglandin D2 receptor 2
Type:Enzyme
Mol. Mass.:43295.45
Organism:Homo sapiens (Human)
Description:Q9Y5Y4
Residue:395
BDBM330437
NameBDBM330437
Synonyms:US9725442, Compound I-123 | US9725442, Compound I-57
TypeSmall organic molecule
Emp. Form.C22H25FN4O5S
Mol. Mass.476.521
SMILESCC(C)Oc1ccc(cn1)S(=O)(=O)N1C[C@@H](C)[C@H](C1)n1nc(CC(O)=O)c2ccc(F)cc12