Reaction Details
TargetVasopressin V1b receptor
LigandBDBM260219
Substrate/Competitorn/a
Meas. Tech.Binding Test for V1b Receptor
pH7.4±n/a
Temperature298.15±n/a K
IC50 3.20±n/a nM
Commentsextracted
Citation Yoshinaga, MKuwada, TMiyakoshi, NIshizaka, TWakasugi, DShirokawa, SHattori, NShimazaki, Y Azole derivative US Patent US9522914 Publication Date 12/20/2016
 
Vasopressin V1b receptor
Name:Vasopressin V1b receptor
Type:Enzyme
Mol. Mass.:46985.01
Organism:Homo sapiens (Human)
Description:P47901
Residue:424
BDBM260219
NameBDBM260219
Synonyms:US9522914, A-21
TypeSmall organic molecule
Emp. Form.C28H35FN4O2
Mol. Mass.478.6015
SMILESCOc1cc(ccc1F)-c1nc(cn1CC(=O)NC(C)C)-c1ccc(CCN2CCC(C)C2)cc1