Reaction Details
TargetVasopressin V1b receptor
LigandBDBM260256
Substrate/Competitorn/a
Meas. Tech.Binding Test for V1b Receptor
pH7.4±n/a
Temperature298.15±n/a K
IC50 2.20±n/a nM
Commentsextracted
Citation Yoshinaga, MKuwada, TMiyakoshi, NIshizaka, TWakasugi, DShirokawa, SHattori, NShimazaki, Y Azole derivative US Patent US9522914 Publication Date 12/20/2016
 
Vasopressin V1b receptor
Name:Vasopressin V1b receptor
Type:Enzyme
Mol. Mass.:46985.01
Organism:Homo sapiens (Human)
Description:P47901
Residue:424
BDBM260256
NameBDBM260256
Synonyms:US9522914, B-09
TypeSmall organic molecule
Emp. Form.C27H33ClN6O2
Mol. Mass.509.043
SMILESCC(C)(C)NC(=O)Cn1nc(nc1-c1cccc(Cl)c1)-c1ccc(CCN2C3CCC2COC3)cn1