Reaction Details
TargetCoagulation factor X
LigandBDBM12400
Substrate/CompetitorBDBM12500
Meas. Tech.Factor Xa Inhibition Assay
Ki 3±n/a nM
Citation Nazare, MWill, DWMatter, HSchreuder, HRitter, KUrmann, MEssrich, MBauer, AWagner, MCzech, JLorenz, MLaux, VWehner, V Probing the subpockets of factor Xa reveals two binding modes for inhibitors based on a 2-carboxyindole scaffold: a study combining structure-activity relationship and X-ray crystallography. J Med Chem48:4511-25 (2005) 
 
Coagulation factor X
Name:Coagulation factor X
Type:Enzyme
Mol. Mass.:54726.60
Organism:Homo sapiens (Human)
Description:n/a
Residue:488
BDBM12400
BDBM12500
NameBDBM12400
Synonyms:1-[(4-Chloro-phenylcarbamoyl)-methyl]-1H-indole-2-carboxylic acid (1-isopropylpiperidin-4-yl)-amide 2-Carboxyindole Scaffold 45 | 2-carboxyindole 27
TypeSmall organic molecule
Emp. Form.C25H29ClN4O2
Mol. Mass.452.976
SMILESCC(C)N1CCC(CC1)NC(=O)c1cc2ccccc2n1CC(=O)Nc1ccc(Cl)cc1