Reaction Details
TargetG-protein coupled receptor 183
LigandBDBM332549
Substrate/Competitorn/a
Meas. Tech.Cell-Based Luminescent Assay
IC50<5±n/a nM
Citation Pinkerton, ABArdecky, RSergienko, EAGonzalez-Lopez, MGanji, SRZou, J Spirocyclic EBI2 modulators US Patent US10196369 Publication Date 2/5/2019
 
G-protein coupled receptor 183
Name:G-protein coupled receptor 183
Type:PROTEIN
Mol. Mass.:41245.79
Organism:Homo sapiens (Human)
Description:ChEMBL_108311
Residue:361
BDBM332549
NameBDBM332549
Synonyms:5-chloroindol-2-yl 2-[(3-fluorophenyl)methyl]-2,7-diazaspiro[3.5]non-7-yl ketone | US10196369, Compound C4
TypeSmall organic molecule
Emp. Form.C23H23ClFN3O
Mol. Mass.411.9
SMILESFc1cccc(CN2CC3(C2)CCN(CC3)C(=O)c2cc3cc(Cl)ccc3[nH]2)c1