Reaction Details
TargetG-protein coupled receptor 183
LigandBDBM332554
Substrate/Competitorn/a
Meas. Tech.Cell-Based Luminescent Assay
IC50<5±n/a nM
Citation Pinkerton, ABArdecky, RSergienko, EAGonzalez-Lopez, MGanji, SRZou, J Spirocyclic EBI2 modulators US Patent US10196369 Publication Date 2/5/2019
 
G-protein coupled receptor 183
Name:G-protein coupled receptor 183
Type:PROTEIN
Mol. Mass.:41245.79
Organism:Homo sapiens (Human)
Description:ChEMBL_108311
Residue:361
BDBM332554
NameBDBM332554
Synonyms:(2E)-1-{2-[(3,4-dimethoxyphenyl)carbonyl]-2,7-diazaspiro[3.5]non-7-yl}-3-(4-bromophenyl)prop-2-en-1-one | US10196369, Compound C9
TypeSmall organic molecule
Emp. Form.C25H27BrN2O4
Mol. Mass.499.397
SMILESCOc1ccc(cc1OC)C(=O)N1CC2(C1)CCN(CC2)C(=O)\C=C\c1ccc(Br)cc1