Reaction Details
TargetG-protein coupled receptor 183
LigandBDBM332564
Substrate/Competitorn/a
Meas. Tech.Cell-Based Luminescent Assay
IC50<5±n/a nM
Citation Pinkerton, ABArdecky, RSergienko, EAGonzalez-Lopez, MGanji, SRZou, J Spirocyclic EBI2 modulators US Patent US10196369 Publication Date 2/5/2019
 
G-protein coupled receptor 183
Name:G-protein coupled receptor 183
Type:PROTEIN
Mol. Mass.:41245.79
Organism:Homo sapiens (Human)
Description:ChEMBL_108311
Residue:361
BDBM332564
NameBDBM332564
Synonyms:(2E)-3-(4-bromophenyl)-1-{7-[(4-chlorophenyl)carbonyl]-2,7-diazaspiro[3.5]non-2-yl}prop-2-en-1-one | US10196369, Compound C19
TypeSmall organic molecule
Emp. Form.C23H22BrClN2O2
Mol. Mass.473.79
SMILESClc1ccc(cc1)C(=O)N1CCC2(CN(C2)C(=O)\C=C\c2ccc(Br)cc2)CC1