Reaction Details
TargetG-protein coupled receptor 183
LigandBDBM332590
Substrate/Competitorn/a
Meas. Tech.Cell-Based Luminescent Assay
IC50<5±n/a nM
Citation Pinkerton, ABArdecky, RSergienko, EAGonzalez-Lopez, MGanji, SRZou, J Spirocyclic EBI2 modulators US Patent US10196369 Publication Date 2/5/2019
 
G-protein coupled receptor 183
Name:G-protein coupled receptor 183
Type:PROTEIN
Mol. Mass.:41245.79
Organism:Homo sapiens (Human)
Description:ChEMBL_108311
Residue:361
BDBM332590
NameBDBM332590
Synonyms:(2E)-3-(4-bromophenyl)-1-(7-{[4-fluoro-2-(trifluoromethyl)phenyl]carbonyl}-2,7-diazaspiro[3.5]non-2-yl)prop-2-en-1-one | US10196369, Compound C45
TypeSmall organic molecule
Emp. Form.C24H21BrF4N2O2
Mol. Mass.525.333
SMILESFc1ccc(C(=O)N2CCC3(CN(C3)C(=O)\C=C\c3ccc(Br)cc3)CC2)c(c1)C(F)(F)F