Reaction Details
TargetG-protein coupled receptor 183
LigandBDBM332645
Substrate/Competitorn/a
Meas. Tech.Cell-Based Luminescent Assay
IC50<5±n/a nM
Citation Pinkerton, ABArdecky, RSergienko, EAGonzalez-Lopez, MGanji, SRZou, J Spirocyclic EBI2 modulators US Patent US10196369 Publication Date 2/5/2019
 
G-protein coupled receptor 183
Name:G-protein coupled receptor 183
Type:PROTEIN
Mol. Mass.:41245.79
Organism:Homo sapiens (Human)
Description:ChEMBL_108311
Residue:361
BDBM332645
NameBDBM332645
Synonyms:5-chloroindol-2-yl 9-{[3-fluoro-4-(trifluoromethyl)phenyl]carbonyl}-3,9-diazaspiro[5.5]undec-3-yl ketone | US10196369, Compound C100
TypeSmall organic molecule
Emp. Form.C26H24ClF4N3O2
Mol. Mass.521.934
SMILESFc1cc(ccc1C(F)(F)F)C(=O)N1CCC2(CCN(CC2)C(=O)c2cc3cc(Cl)ccc3[nH]2)CC1