Reaction Details
TargetG-protein coupled receptor 183
LigandBDBM332646
Substrate/Competitorn/a
Meas. Tech.Cell-Based Luminescent Assay
IC50<5±n/a nM
Citation Pinkerton, ABArdecky, RSergienko, EAGonzalez-Lopez, MGanji, SRZou, J Spirocyclic EBI2 modulators US Patent US10196369 Publication Date 2/5/2019
 
G-protein coupled receptor 183
Name:G-protein coupled receptor 183
Type:PROTEIN
Mol. Mass.:41245.79
Organism:Homo sapiens (Human)
Description:ChEMBL_108311
Residue:361
BDBM332646
NameBDBM332646
Synonyms:5-bromoindol-2-yl 7-{[4-(trifluoromethyl)phenyl]carbonyl}-2,7-diazaspiro[3.5]non-2-yl ketone | US10196369, Compound D1
TypeSmall organic molecule
Emp. Form.C24H21BrF3N3O2
Mol. Mass.520.342
SMILESFC(F)(F)c1ccc(cc1)C(=O)N1CCC2(CN(C2)C(=O)c2cc3cc(Br)ccc3[nH]2)CC1