Reaction Details
TargetTyrosine-protein kinase ABL1 [T315I]
LigandBDBM332701
Substrate/Competitorn/a
Meas. Tech.In Vitro Biochemical Assay
Ki 2.10±n/a nM
Citation Soellner, MBPhadke, S Inhibitors of BCR-ABL mutants and use thereof US Patent US10196378 Publication Date 2/5/2019
 
Tyrosine-protein kinase ABL1 [T315I]
Name:Tyrosine-protein kinase ABL1 [T315I]
Type:n/a
Mol. Mass.:122909.35
Organism:Homo sapiens (Human)
Description:P00519 (T315I)
Residue:1130
BDBM332701
NameBDBM332701
Synonyms:US10196378, Compound C04
TypeSmall organic molecule
Emp. Form.C29H29F3N6O
Mol. Mass.534.5754
SMILESCN1CCN(Cc2ccc(NC(=O)Nc3ccc(Nc4ccc5ncccc5c4)cc3)cc2C(F)(F)F)CC1