Reaction Details
TargetTyrosine-protein kinase ABL1 [Y253F]
LigandBDBM332705
Substrate/Competitorn/a
Meas. Tech.In Vitro Biochemical Assay
Ki 3.40±n/a nM
Citation Soellner, MBPhadke, S Inhibitors of BCR-ABL mutants and use thereof US Patent US10196378 Publication Date 2/5/2019
 
Tyrosine-protein kinase ABL1 [Y253F]
Name:Tyrosine-protein kinase ABL1 [Y253F]
Type:Enzyme Catalytic Domain
Mol. Mass.:122881.30
Organism:Homo sapiens (Human)
Description:P00519[Y253F]
Residue:1130
BDBM332705
NameBDBM332705
Synonyms:US10196378, Compound C08
TypeSmall organic molecule
Emp. Form.C31H27N7O2
Mol. Mass.529.5918
SMILESCC(C)(C)c1cc(NC(=O)Nc2ccc(Oc3ccc4ncncc4c3)cc2)n(n1)-c1ccc2ncccc2c1