Reaction Details
TargetTyrosine-protein kinase ABL1
LigandBDBM332706
Substrate/Competitorn/a
Meas. Tech.In Vitro Biochemical Assay
Ki 0.640±n/a nM
Citation Soellner, MBPhadke, S Inhibitors of BCR-ABL mutants and use thereof US Patent US10196378 Publication Date 2/5/2019
 
Tyrosine-protein kinase ABL1
Name:Tyrosine-protein kinase ABL1
Type:Enzyme
Mol. Mass.:122897.30
Organism:Homo sapiens (Human)
Description:P00519
Residue:1130
BDBM332706
NameBDBM332706
Synonyms:US10196378, Compound C09 | US10196378, Compound C10
TypeSmall organic molecule
Emp. Form.C32H28N6O2
Mol. Mass.528.6037
SMILESCC(C)(C)c1cc(NC(=O)Nc2ccc(Oc3ccc4cccnc4c3)cc2)n(n1)-c1ccc2ncccc2c1