Reaction Details
TargetNon-receptor tyrosine-protein kinase TYK2
LigandBDBM332929
Substrate/Competitorn/a
Meas. Tech.Tyk2 & JAK2 Caliper Assay
Ki<10±n/a nM
Citation Masse, CEGreenwood, JRRomero, DLHarriman, GCWester, RTShelley, MKennedy-Smith, JJDahlgren, M TYK2 inhibitors and uses thereof US Patent US10196390 Publication Date 2/5/2019
 
Non-receptor tyrosine-protein kinase TYK2
Name:Non-receptor tyrosine-protein kinase TYK2
Type:Protein
Mol. Mass.:133666.03
Organism:Homo sapiens (Human)
Description:P29597
Residue:1187
BDBM332929
NameBDBM332929
Synonyms:US10196390, Compound I-218
TypeSmall organic molecule
Emp. Form.C24H21F2N5O2
Mol. Mass.449.4526
SMILESCC1(C)C[C@H](C(=O)N1)c1ccc(Nc2nc(nc3CNC(=O)c23)-c2c(F)cccc2F)cc1