Reaction Details
TargetTyrosine-protein kinase JAK2
LigandBDBM332934
Substrate/Competitorn/a
Ki<10±n/a nM
Citation Masse, CEGreenwood, JRRomero, DLHarriman, GCWester, RTShelley, MKennedy-Smith, JJDahlgren, M TYK2 inhibitors and uses thereof US Patent US10196390 Publication Date 2/5/2019
 
Tyrosine-protein kinase JAK2
Name:Tyrosine-protein kinase JAK2
Type:Protein
Mol. Mass.:130684.68
Organism:Homo sapiens (Human)
Description:O60674
Residue:1132
BDBM332934
NameBDBM332934
Synonyms:US10196390, Compound I-223
TypeSmall organic molecule
Emp. Form.C24H22F2N6O2
Mol. Mass.464.4673
SMILESCN1CCNC(C)(C1=O)c1ccc(Nc2cc(nc3CNC(=O)c23)-c2c(F)cccc2F)nc1