Reaction Details
TargetGenome polyprotein
LigandBDBM333022
Substrate/Competitorn/a
Meas. Tech.HBsAg Assay
IC50 750±n/a nM
Citation Cheng, ZWang, MYang, S Tetrahydropyridopyrimidines and tetrahydropyridopyridines for the treatment and prophylaxis of hepatitis B virus infection US Patent US10196391 Publication Date 2/5/2019
 
Genome polyprotein
Name:Genome polyprotein
Type:PROTEIN
Mol. Mass.:312770.83
Organism:Hepatitis GB virus B
Description:ChEMBL_330657
Residue:2864
BDBM333022
NameBDBM333022
Synonyms:US10196391, Example 22
TypeSmall organic molecule
Emp. Form.C21H20F2N4O
Mol. Mass.382.4065
SMILESCCCOc1cc(cc(F)c1F)N1CCc2nc(ncc2C1)-c1ccccn1